{"text_format":"1","workbook":"xlsx","n_sheets":3,"sheets":["Eingabe","Punkte-Note","Punkteeingabe"],"not_rendered":{"charts":1,"images":3,"macros":1,"external_links":0,"defined_names":3,"comments":0,"pivot_tables":0},"unopened":[],"bounds":{"document_bytes":16777216,"sheet_cells":100000,"rows_first":2000,"rows_last":500,"rows_between":2000,"halvings":0,"cell_chars":16384,"cell_head_chars":4096},"cells_cut":0,"cells_raw":0,"read":"whole","date_system":"1900"}

{"sheet":"Eingabe","index":0,"n_rows":206,"n_cols":21,"rows_kept":206,"cut":false,"hidden":false,"merged":[]}
["Gesamtpunktzahl",23,null,null,null,null,null,null,null,null,"Punkt-Note",null,null,null,"Punkte","Note(pkte)",null,null,"linear (wenig 1 und 6)","mehr 1","mehr 1 und 6"]
["Note:","3/4","bei",{"$f":"B1/2","v":11.5},"Punkten (halbe Punktzahl)",null,null,null,null,null,{"$f":"VLOOKUP(B2,A4:B24,2,FALSE)","v":"10"},null,null,null,{"$f":"Max","v":23},{"$f":"ROUND($K$13*(O2*O2)+$K$12*O2+20,0)","v":0},{"$f":"INDIRECT(ADDRESS(P2+4,1,1,1))","v":"1"},{"$f":"O2","v":23},{"$f":"ROUND($K$13*(R2*R2)+$K$12*R2+20,0)","v":0},{"$f":"ROUND($K$13*(S2*S2)+$K$12*S2+19.5,0)","v":20},{"$f":"ROUND($K$13*(T2*T2)+$K$12*T2+19.5+(Max-T2-1)/Max,0)","v":2}]
["NOTE",null,null,null,null,null,null,null,null,null,null,null,null,null,{"$f":"O2-1","v":22},{"$f":"ROUND($K$13*(O3*O3)+$K$12*O3+19.5+(Max-O3-1)/Max,0)","v":0},{"$f":"INDIRECT(ADDRESS(P3+4,1,1,1))","v":"1"},{"$f":"O3","v":22}]
["1","0",{"$f":"VLOOKUP(A4,$Q$2:$R$206,2,FALSE)","v":23},{"$f":"IF(E4=\"\",\"\",\"bis\")","v":"bis"},{"$f":"IF(C5+1<C4,C5+1,\"\")","v":22},{"$f":"A4","v":"1"},null,null,null,null,null,null,null,null,{"$f":"O3-1","v":21},1,"1-",21]
["1-","1",21,{"$f":"IF(E5=\"\",\"\",\"bis\")","v":""},"",{"$f":"A5","v":"1-"},null,null,null,null,null,null,null,null,20,2,"1/2",20]
["1/2","2",20,"","","1/2",null,null,null,null,null,null,null,null,19,3,"2+",19]
["2+","3",19,"","","2+",null,null,null,null,null,null,null,null,18,4,"2",18]
["2","4",18,"","","2",null,null,null,null,null,null,null,null,17,5,"2-",17]
["2-","5",17,"","","2-",null,null,null,"Punkte",0,{"$f":"D2","v":11.5},{"$f":"B1","v":23},null,16,6,"2/3",16]
["2/3","6",16,"","","2/3",null,null,null,"\"Note\"",20,16,0,null,15,7,"3+",15]
["3+","7",15,"","","3+",null,null,null,"NotenPkt=a x^2+ b x +20",null,"(x sind die erreichten Punkte)",null,null,14,8,"3",14]
["3","8",14,"","","3",null,null,null,"b",{"$f":"(K2-15)/(Max/4)","v":-0.86956521739130432},null,null,null,13,9,"3-",13]
["3-","9",13,"","","3-",null,null,null,"a",{"$f":"(-20-K12*Max)/(Max*Max)","v":0},null,null,null,12,10,"3/4",12]
["3/4","10",12,"bis",11,"3/4",null,null,null,null,null,null,null,null,11,10,"3/4",11]
["4+","11",10,"","","4+",null,null,null,null,null,null,null,null,10,11,"4+",10]
["4","12",9,"","","4",null,null,null,null,null,null,null,null,9,12,"4",9,"Resultat:"]
["4-","13",8,"","","4-",null,null,null,null,null,null,null,null,8,13,"4-",8]
["4/5","14",7,"",{"$f":"IF(C19+1<C18,C19+1,\"\")","v":""},"4/5",null,null,null,null,null,null,null,null,7,14,"4/5",7]
["5+","15",6,"","","5+","Schnitt:",{"$f":"Punkteeingabe!F1","v":2.7857142857142856},null,null,null,null,null,null,6,15,"5+",6]
["5","16",5,"",{"$f":"IF(C21+1<C20,C21+1,\"\")","v":""},"5",null,null,null,null,null,null,null,null,5,16,"5",5]
["5-","17",4,"","","5-","Erklärung",null,null,null,null,null,null,null,4,17,"5-",4]
["5/6","18",3,"","","5/6","Links gleiche Zahl wie RECHTS eintragen ==> Doppelblock rutscht hoch",null,null,null,null,null,null,null,3,18,"5/6",3]
["6+","19",2,"","","6+","\"Rechte Zahl\" unter Doppelblock schreiben ==> Doppelblock rutscht runter",null,null,null,null,null,null,null,2,19,"6+",2]
["6","20",1,"bis",0,"6",null,null,null,null,null,null,null,null,1,20,"6",1]
[null,null,"nur hier ändern",null,null,null,null,null,null,null,null,null,null,null,0,20,"6",0]
[{"$f":"A4","v":"1"},{"$f":"C4","v":23},null,null,null,null,null,null,null,null,null,null,null,null,-1,21,0,-1]
[{"$f":"A5","v":"1-"},{"$f":"C5","v":21},null,null,null,null,null,null,null,null,null,null,null,null,-2,22,"1",-2]
["1/2",20,null,null,null,null,null,null,null,null,null,null,null,null,-3,23,"1-",-3]
["2+",19,null,null,null,null,null,null,null,null,null,null,null,null,-4,24,"1/2",-4]
["2",18,null,null,null,null,null,null,null,null,null,null,null,null,-5,25,"2+",-5]
["2-",17,null,null,null,null,null,null,null,null,null,null,null,null,-6,26,"2",-6]
["2/3",16,null,null,null,null,null,null,null,null,null,null,null,null,-7,27,"2-",-7]
["3+",15,null,null,null,null,null,null,null,null,null,null,null,null,-8,28,"2/3",-8]
["3",14,null,null,null,null,null,null,null,null,null,null,null,null,-9,29,"3+",-9]
["3-",13,null,null,null,null,null,null,null,null,null,null,null,null,-10,30,"3",-10]
["3/4",12,null,null,null,null,null,null,null,null,null,null,null,null,-11,31,"3-",-11]
["4+",10,null,null,null,null,null,null,null,null,null,null,null,null,-12,31,"3-",-12]
["4",9,null,null,null,null,null,null,null,null,null,null,null,null,-13,32,"3/4",-13]
["4-",8,null,null,null,null,null,null,null,null,null,null,null,null,-14,33,"4+",-14]
["4/5",7,null,null,null,null,null,null,null,null,null,null,null,null,-15,34,"4",-15]
["5+",6,null,null,null,null,null,null,null,null,null,null,null,null,-16,35,"4-",-16]
["5",5,null,null,null,null,null,null,null,null,null,null,null,null,-17,36,"4/5",-17]
["5-",4,null,null,null,null,null,null,null,null,null,null,null,null,-18,37,"5+",-18]
["5/6",3,null,null,null,null,null,null,null,null,null,null,null,null,-19,38,"5",-19]
["6+",2,null,null,null,null,null,null,null,null,null,null,null,null,-20,39,"5-",-20]
["6",1,null,null,null,null,null,null,null,null,null,null,null,null,-21,40,"5/6",-21]
[null,null,null,null,null,null,null,null,null,null,null,null,null,null,-22,41,"6+",-22]
[null,null,null,null,null,null,null,null,null,null,null,null,null,null,-23,41,"6+",-23]
[null,null,null,null,null,null,null,null,null,null,null,null,null,null,-24,42,"6",-24]
[null,null,null,null,null,null,null,null,null,null,null,null,null,null,-25,43,0,-25]
[null,null,null,null,null,null,null,null,null,null,null,null,null,null,-26,44,0,-26]
[null,null,null,null,null,null,null,null,null,null,null,null,null,null,-27,45,0,-27]
[null,null,null,null,null,null,null,null,null,null,null,null,null,null,-28,46,0,-28]
[null,null,null,null,null,null,null,null,null,null,null,null,null,null,-29,47,0,-29]
[null,null,null,null,null,null,null,null,null,null,null,null,null,null,-30,48,0,-30]
[null,null,null,null,null,null,null,null,null,null,null,null,null,null,-31,49,0,-31]
[null,null,null,null,null,null,null,null,null,null,null,null,null,null,-32,50,0,-32]
[null,null,null,null,null,null,null,null,null,null,null,null,null,null,-33,51,0,-33]
[null,null,null,null,null,null,null,null,null,null,null,null,null,null,-34,52,0,-34]
[null,null,null,null,null,null,null,null,null,null,null,null,null,null,-35,52,0,-35]
{"$rows_left_out":147}
{"sheet":"Punkte-Note","index":1,"n_rows":206,"n_cols":2,"rows_kept":206,"cut":false,"hidden":false,"merged":[]}
["Punkte","Note"]
[{"$f":"IF(Eingabe!O2>-1,Eingabe!O2,\"\")","v":23},{"$f":"IF(A2=\"\",\"\",IF(IFERROR(VLOOKUP(A2,Eingabe!$C$4:$F$24,4,FALSE),100)=100,B1,IFERROR(VLOOKUP(A2,Eingabe!$C$4:$F$24,4,FALSE),100)))","v":"1"}]
[{"$f":"IF(Eingabe!O3>-1,Eingabe!O3,\"\")","v":22},{"$f":"IF(A3=\"\",\"\",IF(IFERROR(VLOOKUP(A3,Eingabe!$C$4:$F$24,4,FALSE),100)=100,B2,IFERROR(VLOOKUP(A3,Eingabe!$C$4:$F$24,4,FALSE),100)))","v":"1"}]
[{"$f":"IF(Eingabe!O4>-1,Eingabe!O4,\"\")","v":21},{"$f":"IF(A4=\"\",\"\",IF(IFERROR(VLOOKUP(A4,Eingabe!$C$4:$F$24,4,FALSE),100)=100,B3,IFERROR(VLOOKUP(A4,Eingabe!$C$4:$F$24,4,FALSE),100)))","v":"1-"}]
[{"$f":"IF(Eingabe!O5>-1,Eingabe!O5,\"\")","v":20},{"$f":"IF(A5=\"\",\"\",IF(IFERROR(VLOOKUP(A5,Eingabe!$C$4:$F$24,4,FALSE),100)=100,B4,IFERROR(VLOOKUP(A5,Eingabe!$C$4:$F$24,4,FALSE),100)))","v":"1/2"}]
[{"$f":"IF(Eingabe!O6>-1,Eingabe!O6,\"\")","v":19},{"$f":"IF(A6=\"\",\"\",IF(IFERROR(VLOOKUP(A6,Eingabe!$C$4:$F$24,4,FALSE),100)=100,B5,IFERROR(VLOOKUP(A6,Eingabe!$C$4:$F$24,4,FALSE),100)))","v":"2+"}]
[{"$f":"IF(Eingabe!O7>-1,Eingabe!O7,\"\")","v":18},{"$f":"IF(A7=\"\",\"\",IF(IFERROR(VLOOKUP(A7,Eingabe!$C$4:$F$24,4,FALSE),100)=100,B6,IFERROR(VLOOKUP(A7,Eingabe!$C$4:$F$24,4,FALSE),100)))","v":"2"}]
[{"$f":"IF(Eingabe!O8>-1,Eingabe!O8,\"\")","v":17},{"$f":"IF(A8=\"\",\"\",IF(IFERROR(VLOOKUP(A8,Eingabe!$C$4:$F$24,4,FALSE),100)=100,B7,IFERROR(VLOOKUP(A8,Eingabe!$C$4:$F$24,4,FALSE),100)))","v":"2-"}]
[{"$f":"IF(Eingabe!O9>-1,Eingabe!O9,\"\")","v":16},{"$f":"IF(A9=\"\",\"\",IF(IFERROR(VLOOKUP(A9,Eingabe!$C$4:$F$24,4,FALSE),100)=100,B8,IFERROR(VLOOKUP(A9,Eingabe!$C$4:$F$24,4,FALSE),100)))","v":"2/3"}]
[{"$f":"IF(Eingabe!O10>-1,Eingabe!O10,\"\")","v":15},{"$f":"IF(A10=\"\",\"\",IF(IFERROR(VLOOKUP(A10,Eingabe!$C$4:$F$24,4,FALSE),100)=100,B9,IFERROR(VLOOKUP(A10,Eingabe!$C$4:$F$24,4,FALSE),100)))","v":"3+"}]
[{"$f":"IF(Eingabe!O11>-1,Eingabe!O11,\"\")","v":14},{"$f":"IF(A11=\"\",\"\",IF(IFERROR(VLOOKUP(A11,Eingabe!$C$4:$F$24,4,FALSE),100)=100,B10,IFERROR(VLOOKUP(A11,Eingabe!$C$4:$F$24,4,FALSE),100)))","v":"3"}]
[{"$f":"IF(Eingabe!O12>-1,Eingabe!O12,\"\")","v":13},{"$f":"IF(A12=\"\",\"\",IF(IFERROR(VLOOKUP(A12,Eingabe!$C$4:$F$24,4,FALSE),100)=100,B11,IFERROR(VLOOKUP(A12,Eingabe!$C$4:$F$24,4,FALSE),100)))","v":"3-"}]
[{"$f":"IF(Eingabe!O13>-1,Eingabe!O13,\"\")","v":12},{"$f":"IF(A13=\"\",\"\",IF(IFERROR(VLOOKUP(A13,Eingabe!$C$4:$F$24,4,FALSE),100)=100,B12,IFERROR(VLOOKUP(A13,Eingabe!$C$4:$F$24,4,FALSE),100)))","v":"3/4"}]
[{"$f":"IF(Eingabe!O14>-1,Eingabe!O14,\"\")","v":11},{"$f":"IF(A14=\"\",\"\",IF(IFERROR(VLOOKUP(A14,Eingabe!$C$4:$F$24,4,FALSE),100)=100,B13,IFERROR(VLOOKUP(A14,Eingabe!$C$4:$F$24,4,FALSE),100)))","v":"3/4"}]
[{"$f":"IF(Eingabe!O15>-1,Eingabe!O15,\"\")","v":10},{"$f":"IF(A15=\"\",\"\",IF(IFERROR(VLOOKUP(A15,Eingabe!$C$4:$F$24,4,FALSE),100)=100,B14,IFERROR(VLOOKUP(A15,Eingabe!$C$4:$F$24,4,FALSE),100)))","v":"4+"}]
[{"$f":"IF(Eingabe!O16>-1,Eingabe!O16,\"\")","v":9},{"$f":"IF(A16=\"\",\"\",IF(IFERROR(VLOOKUP(A16,Eingabe!$C$4:$F$24,4,FALSE),100)=100,B15,IFERROR(VLOOKUP(A16,Eingabe!$C$4:$F$24,4,FALSE),100)))","v":"4"}]
[{"$f":"IF(Eingabe!O17>-1,Eingabe!O17,\"\")","v":8},{"$f":"IF(A17=\"\",\"\",IF(IFERROR(VLOOKUP(A17,Eingabe!$C$4:$F$24,4,FALSE),100)=100,B16,IFERROR(VLOOKUP(A17,Eingabe!$C$4:$F$24,4,FALSE),100)))","v":"4-"}]
[{"$f":"IF(Eingabe!O18>-1,Eingabe!O18,\"\")","v":7},{"$f":"IF(A18=\"\",\"\",IF(IFERROR(VLOOKUP(A18,Eingabe!$C$4:$F$24,4,FALSE),100)=100,B17,IFERROR(VLOOKUP(A18,Eingabe!$C$4:$F$24,4,FALSE),100)))","v":"4/5"}]
[{"$f":"IF(Eingabe!O19>-1,Eingabe!O19,\"\")","v":6},{"$f":"IF(A19=\"\",\"\",IF(IFERROR(VLOOKUP(A19,Eingabe!$C$4:$F$24,4,FALSE),100)=100,B18,IFERROR(VLOOKUP(A19,Eingabe!$C$4:$F$24,4,FALSE),100)))","v":"5+"}]
[{"$f":"IF(Eingabe!O20>-1,Eingabe!O20,\"\")","v":5},{"$f":"IF(A20=\"\",\"\",IF(IFERROR(VLOOKUP(A20,Eingabe!$C$4:$F$24,4,FALSE),100)=100,B19,IFERROR(VLOOKUP(A20,Eingabe!$C$4:$F$24,4,FALSE),100)))","v":"5"}]
[{"$f":"IF(Eingabe!O21>-1,Eingabe!O21,\"\")","v":4},{"$f":"IF(A21=\"\",\"\",IF(IFERROR(VLOOKUP(A21,Eingabe!$C$4:$F$24,4,FALSE),100)=100,B20,IFERROR(VLOOKUP(A21,Eingabe!$C$4:$F$24,4,FALSE),100)))","v":"5-"}]
[{"$f":"IF(Eingabe!O22>-1,Eingabe!O22,\"\")","v":3},{"$f":"IF(A22=\"\",\"\",IF(IFERROR(VLOOKUP(A22,Eingabe!$C$4:$F$24,4,FALSE),100)=100,B21,IFERROR(VLOOKUP(A22,Eingabe!$C$4:$F$24,4,FALSE),100)))","v":"5/6"}]
[{"$f":"IF(Eingabe!O23>-1,Eingabe!O23,\"\")","v":2},{"$f":"IF(A23=\"\",\"\",IF(IFERROR(VLOOKUP(A23,Eingabe!$C$4:$F$24,4,FALSE),100)=100,B22,IFERROR(VLOOKUP(A23,Eingabe!$C$4:$F$24,4,FALSE),100)))","v":"6+"}]
[{"$f":"IF(Eingabe!O24>-1,Eingabe!O24,\"\")","v":1},{"$f":"IF(A24=\"\",\"\",IF(IFERROR(VLOOKUP(A24,Eingabe!$C$4:$F$24,4,FALSE),100)=100,B23,IFERROR(VLOOKUP(A24,Eingabe!$C$4:$F$24,4,FALSE),100)))","v":"6"}]
[{"$f":"IF(Eingabe!O25>-1,Eingabe!O25,\"\")","v":0},{"$f":"IF(A25=\"\",\"\",IF(IFERROR(VLOOKUP(A25,Eingabe!$C$4:$F$24,4,FALSE),100)=100,B24,IFERROR(VLOOKUP(A25,Eingabe!$C$4:$F$24,4,FALSE),100)))","v":"6"}]
[{"$f":"IF(Eingabe!O26>-1,Eingabe!O26,\"\")","v":""},{"$f":"IF(A26=\"\",\"\",IF(IFERROR(VLOOKUP(A26,Eingabe!$C$4:$F$24,4,FALSE),100)=100,B25,IFERROR(VLOOKUP(A26,Eingabe!$C$4:$F$24,4,FALSE),100)))","v":""}]
[{"$f":"IF(Eingabe!O27>-1,Eingabe!O27,\"\")","v":""},{"$f":"IF(A27=\"\",\"\",IF(IFERROR(VLOOKUP(A27,Eingabe!$C$4:$F$24,4,FALSE),100)=100,B26,IFERROR(VLOOKUP(A27,Eingabe!$C$4:$F$24,4,FALSE),100)))","v":""}]
[{"$f":"IF(Eingabe!O28>-1,Eingabe!O28,\"\")","v":""},{"$f":"IF(A28=\"\",\"\",IF(IFERROR(VLOOKUP(A28,Eingabe!$C$4:$F$24,4,FALSE),100)=100,B27,IFERROR(VLOOKUP(A28,Eingabe!$C$4:$F$24,4,FALSE),100)))","v":""}]
[{"$f":"IF(Eingabe!O29>-1,Eingabe!O29,\"\")","v":""},{"$f":"IF(A29=\"\",\"\",IF(IFERROR(VLOOKUP(A29,Eingabe!$C$4:$F$24,4,FALSE),100)=100,B28,IFERROR(VLOOKUP(A29,Eingabe!$C$4:$F$24,4,FALSE),100)))","v":""}]
[{"$f":"IF(Eingabe!O30>-1,Eingabe!O30,\"\")","v":""},{"$f":"IF(A30=\"\",\"\",IF(IFERROR(VLOOKUP(A30,Eingabe!$C$4:$F$24,4,FALSE),100)=100,B29,IFERROR(VLOOKUP(A30,Eingabe!$C$4:$F$24,4,FALSE),100)))","v":""}]
[{"$f":"IF(Eingabe!O31>-1,Eingabe!O31,\"\")","v":""},{"$f":"IF(A31=\"\",\"\",IF(IFERROR(VLOOKUP(A31,Eingabe!$C$4:$F$24,4,FALSE),100)=100,B30,IFERROR(VLOOKUP(A31,Eingabe!$C$4:$F$24,4,FALSE),100)))","v":""}]
[{"$f":"IF(Eingabe!O32>-1,Eingabe!O32,\"\")","v":""},{"$f":"IF(A32=\"\",\"\",IF(IFERROR(VLOOKUP(A32,Eingabe!$C$4:$F$24,4,FALSE),100)=100,B31,IFERROR(VLOOKUP(A32,Eingabe!$C$4:$F$24,4,FALSE),100)))","v":""}]
[{"$f":"IF(Eingabe!O33>-1,Eingabe!O33,\"\")","v":""},{"$f":"IF(A33=\"\",\"\",IF(IFERROR(VLOOKUP(A33,Eingabe!$C$4:$F$24,4,FALSE),100)=100,B32,IFERROR(VLOOKUP(A33,Eingabe!$C$4:$F$24,4,FALSE),100)))","v":""}]
[{"$f":"IF(Eingabe!O34>-1,Eingabe!O34,\"\")","v":""},{"$f":"IF(A34=\"\",\"\",IF(IFERROR(VLOOKUP(A34,Eingabe!$C$4:$F$24,4,FALSE),100)=100,B33,IFERROR(VLOOKUP(A34,Eingabe!$C$4:$F$24,4,FALSE),100)))","v":""}]
[{"$f":"IF(Eingabe!O35>-1,Eingabe!O35,\"\")","v":""},{"$f":"IF(A35=\"\",\"\",IF(IFERROR(VLOOKUP(A35,Eingabe!$C$4:$F$24,4,FALSE),100)=100,B34,IFERROR(VLOOKUP(A35,Eingabe!$C$4:$F$24,4,FALSE),100)))","v":""}]
[{"$f":"IF(Eingabe!O36>-1,Eingabe!O36,\"\")","v":""},{"$f":"IF(A36=\"\",\"\",IF(IFERROR(VLOOKUP(A36,Eingabe!$C$4:$F$24,4,FALSE),100)=100,B35,IFERROR(VLOOKUP(A36,Eingabe!$C$4:$F$24,4,FALSE),100)))","v":""}]
[{"$f":"IF(Eingabe!O37>-1,Eingabe!O37,\"\")","v":""},{"$f":"IF(A37=\"\",\"\",IF(IFERROR(VLOOKUP(A37,Eingabe!$C$4:$F$24,4,FALSE),100)=100,B36,IFERROR(VLOOKUP(A37,Eingabe!$C$4:$F$24,4,FALSE),100)))","v":""}]
[{"$f":"IF(Eingabe!O38>-1,Eingabe!O38,\"\")","v":""},{"$f":"IF(A38=\"\",\"\",IF(IFERROR(VLOOKUP(A38,Eingabe!$C$4:$F$24,4,FALSE),100)=100,B37,IFERROR(VLOOKUP(A38,Eingabe!$C$4:$F$24,4,FALSE),100)))","v":""}]
[{"$f":"IF(Eingabe!O39>-1,Eingabe!O39,\"\")","v":""},{"$f":"IF(A39=\"\",\"\",IF(IFERROR(VLOOKUP(A39,Eingabe!$C$4:$F$24,4,FALSE),100)=100,B38,IFERROR(VLOOKUP(A39,Eingabe!$C$4:$F$24,4,FALSE),100)))","v":""}]
[{"$f":"IF(Eingabe!O40>-1,Eingabe!O40,\"\")","v":""},{"$f":"IF(A40=\"\",\"\",IF(IFERROR(VLOOKUP(A40,Eingabe!$C$4:$F$24,4,FALSE),100)=100,B39,IFERROR(VLOOKUP(A40,Eingabe!$C$4:$F$24,4,FALSE),100)))","v":""}]
[{"$f":"IF(Eingabe!O41>-1,Eingabe!O41,\"\")","v":""},{"$f":"IF(A41=\"\",\"\",IF(IFERROR(VLOOKUP(A41,Eingabe!$C$4:$F$24,4,FALSE),100)=100,B40,IFERROR(VLOOKUP(A41,Eingabe!$C$4:$F$24,4,FALSE),100)))","v":""}]
[{"$f":"IF(Eingabe!O42>-1,Eingabe!O42,\"\")","v":""},{"$f":"IF(A42=\"\",\"\",IF(IFERROR(VLOOKUP(A42,Eingabe!$C$4:$F$24,4,FALSE),100)=100,B41,IFERROR(VLOOKUP(A42,Eingabe!$C$4:$F$24,4,FALSE),100)))","v":""}]
[{"$f":"IF(Eingabe!O43>-1,Eingabe!O43,\"\")","v":""},{"$f":"IF(A43=\"\",\"\",IF(IFERROR(VLOOKUP(A43,Eingabe!$C$4:$F$24,4,FALSE),100)=100,B42,IFERROR(VLOOKUP(A43,Eingabe!$C$4:$F$24,4,FALSE),100)))","v":""}]
[{"$f":"IF(Eingabe!O44>-1,Eingabe!O44,\"\")","v":""},{"$f":"IF(A44=\"\",\"\",IF(IFERROR(VLOOKUP(A44,Eingabe!$C$4:$F$24,4,FALSE),100)=100,B43,IFERROR(VLOOKUP(A44,Eingabe!$C$4:$F$24,4,FALSE),100)))","v":""}]
[{"$f":"IF(Eingabe!O45>-1,Eingabe!O45,\"\")","v":""},{"$f":"IF(A45=\"\",\"\",IF(IFERROR(VLOOKUP(A45,Eingabe!$C$4:$F$24,4,FALSE),100)=100,B44,IFERROR(VLOOKUP(A45,Eingabe!$C$4:$F$24,4,FALSE),100)))","v":""}]
[{"$f":"IF(Eingabe!O46>-1,Eingabe!O46,\"\")","v":""},{"$f":"IF(A46=\"\",\"\",IF(IFERROR(VLOOKUP(A46,Eingabe!$C$4:$F$24,4,FALSE),100)=100,B45,IFERROR(VLOOKUP(A46,Eingabe!$C$4:$F$24,4,FALSE),100)))","v":""}]
[{"$f":"IF(Eingabe!O47>-1,Eingabe!O47,\"\")","v":""},{"$f":"IF(A47=\"\",\"\",IF(IFERROR(VLOOKUP(A47,Eingabe!$C$4:$F$24,4,FALSE),100)=100,B46,IFERROR(VLOOKUP(A47,Eingabe!$C$4:$F$24,4,FALSE),100)))","v":""}]
[{"$f":"IF(Eingabe!O48>-1,Eingabe!O48,\"\")","v":""},{"$f":"IF(A48=\"\",\"\",IF(IFERROR(VLOOKUP(A48,Eingabe!$C$4:$F$24,4,FALSE),100)=100,B47,IFERROR(VLOOKUP(A48,Eingabe!$C$4:$F$24,4,FALSE),100)))","v":""}]
[{"$f":"IF(Eingabe!O49>-1,Eingabe!O49,\"\")","v":""},{"$f":"IF(A49=\"\",\"\",IF(IFERROR(VLOOKUP(A49,Eingabe!$C$4:$F$24,4,FALSE),100)=100,B48,IFERROR(VLOOKUP(A49,Eingabe!$C$4:$F$24,4,FALSE),100)))","v":""}]
[{"$f":"IF(Eingabe!O50>-1,Eingabe!O50,\"\")","v":""},{"$f":"IF(A50=\"\",\"\",IF(IFERROR(VLOOKUP(A50,Eingabe!$C$4:$F$24,4,FALSE),100)=100,B49,IFERROR(VLOOKUP(A50,Eingabe!$C$4:$F$24,4,FALSE),100)))","v":""}]
[{"$f":"IF(Eingabe!O51>-1,Eingabe!O51,\"\")","v":""},{"$f":"IF(A51=\"\",\"\",IF(IFERROR(VLOOKUP(A51,Eingabe!$C$4:$F$24,4,FALSE),100)=100,B50,IFERROR(VLOOKUP(A51,Eingabe!$C$4:$F$24,4,FALSE),100)))","v":""}]
[{"$f":"IF(Eingabe!O52>-1,Eingabe!O52,\"\")","v":""},{"$f":"IF(A52=\"\",\"\",IF(IFERROR(VLOOKUP(A52,Eingabe!$C$4:$F$24,4,FALSE),100)=100,B51,IFERROR(VLOOKUP(A52,Eingabe!$C$4:$F$24,4,FALSE),100)))","v":""}]
[{"$f":"IF(Eingabe!O53>-1,Eingabe!O53,\"\")","v":""},{"$f":"IF(A53=\"\",\"\",IF(IFERROR(VLOOKUP(A53,Eingabe!$C$4:$F$24,4,FALSE),100)=100,B52,IFERROR(VLOOKUP(A53,Eingabe!$C$4:$F$24,4,FALSE),100)))","v":""}]
[{"$f":"IF(Eingabe!O54>-1,Eingabe!O54,\"\")","v":""},{"$f":"IF(A54=\"\",\"\",IF(IFERROR(VLOOKUP(A54,Eingabe!$C$4:$F$24,4,FALSE),100)=100,B53,IFERROR(VLOOKUP(A54,Eingabe!$C$4:$F$24,4,FALSE),100)))","v":""}]
[{"$f":"IF(Eingabe!O55>-1,Eingabe!O55,\"\")","v":""},{"$f":"IF(A55=\"\",\"\",IF(IFERROR(VLOOKUP(A55,Eingabe!$C$4:$F$24,4,FALSE),100)=100,B54,IFERROR(VLOOKUP(A55,Eingabe!$C$4:$F$24,4,FALSE),100)))","v":""}]
[{"$f":"IF(Eingabe!O56>-1,Eingabe!O56,\"\")","v":""},{"$f":"IF(A56=\"\",\"\",IF(IFERROR(VLOOKUP(A56,Eingabe!$C$4:$F$24,4,FALSE),100)=100,B55,IFERROR(VLOOKUP(A56,Eingabe!$C$4:$F$24,4,FALSE),100)))","v":""}]
[{"$f":"IF(Eingabe!O57>-1,Eingabe!O57,\"\")","v":""},{"$f":"IF(A57=\"\",\"\",IF(IFERROR(VLOOKUP(A57,Eingabe!$C$4:$F$24,4,FALSE),100)=100,B56,IFERROR(VLOOKUP(A57,Eingabe!$C$4:$F$24,4,FALSE),100)))","v":""}]
[{"$f":"IF(Eingabe!O58>-1,Eingabe!O58,\"\")","v":""},{"$f":"IF(A58=\"\",\"\",IF(IFERROR(VLOOKUP(A58,Eingabe!$C$4:$F$24,4,FALSE),100)=100,B57,IFERROR(VLOOKUP(A58,Eingabe!$C$4:$F$24,4,FALSE),100)))","v":""}]
[{"$f":"IF(Eingabe!O59>-1,Eingabe!O59,\"\")","v":""},{"$f":"IF(A59=\"\",\"\",IF(IFERROR(VLOOKUP(A59,Eingabe!$C$4:$F$24,4,FALSE),100)=100,B58,IFERROR(VLOOKUP(A59,Eingabe!$C$4:$F$24,4,FALSE),100)))","v":""}]
[{"$f":"IF(Eingabe!O60>-1,Eingabe!O60,\"\")","v":""},{"$f":"IF(A60=\"\",\"\",IF(IFERROR(VLOOKUP(A60,Eingabe!$C$4:$F$24,4,FALSE),100)=100,B59,IFERROR(VLOOKUP(A60,Eingabe!$C$4:$F$24,4,FALSE),100)))","v":""}]
{"$rows_left_out":147}
{"sheet":"Punkteeingabe","index":2,"n_rows":37,"n_cols":10,"rows_kept":37,"cut":false,"hidden":false,"merged":[]}
["Namen","Punkte","Note",null,"Schnitt:",{"$f":"AVERAGE(D2:D37)","v":2.7857142857142856},null,null,0,{"$f":"\"\"","v":""}]
["Schüler a",12,{"$f":"IF(B2=\"\",,VLOOKUP(B2,'Punkte-Note'!$A$2:$B$178,2,FALSE))","v":"3/4"},{"$f":"VLOOKUP(C2,$I$1:$J$22,2,FALSE)","v":3.5},null,null,null,null,"1",1]
["Schüler b",22,{"$f":"IF(B3=\"\",,VLOOKUP(B3,'Punkte-Note'!$A$2:$B$178,2,FALSE))","v":"1"},{"$f":"VLOOKUP(C3,$I$1:$J$22,2,FALSE)","v":1},null,null,null,null,"1-",1.25]
["Schüler c",9,{"$f":"IF(B4=\"\",,VLOOKUP(B4,'Punkte-Note'!$A$2:$B$178,2,FALSE))","v":"4"},4,null,null,null,null,"1/2",1.5]
["Schüler d",18,{"$f":"IF(B5=\"\",,VLOOKUP(B5,'Punkte-Note'!$A$2:$B$178,2,FALSE))","v":"2"},2,null,null,null,null,"2+",1.75]
["Schüler e",12,{"$f":"IF(B6=\"\",,VLOOKUP(B6,'Punkte-Note'!$A$2:$B$178,2,FALSE))","v":"3/4"},3.5,null,null,null,null,"2",2]
["Schüler f",15,{"$f":"IF(B7=\"\",,VLOOKUP(B7,'Punkte-Note'!$A$2:$B$178,2,FALSE))","v":"3+"},2.75,null,null,null,null,"2-",2.25]
["Schüler g",15,{"$f":"IF(B8=\"\",,VLOOKUP(B8,'Punkte-Note'!$A$2:$B$178,2,FALSE))","v":"3+"},2.75,null,null,null,null,"2/3",2.5]
["usw. …",null,{"$f":"IF(B9=\"\",,VLOOKUP(B9,'Punkte-Note'!$A$2:$B$178,2,FALSE))","v":0},"",null,null,null,null,"3+",2.75]
["c",null,{"$f":"IF(B10=\"\",,VLOOKUP(B10,'Punkte-Note'!$A$2:$B$178,2,FALSE))","v":0},"",null,null,null,null,"3",3]
["a",null,{"$f":"IF(B11=\"\",,VLOOKUP(B11,'Punkte-Note'!$A$2:$B$178,2,FALSE))","v":0},"",null,null,null,null,"3-",2.25]
["b",null,{"$f":"IF(B12=\"\",,VLOOKUP(B12,'Punkte-Note'!$A$2:$B$178,2,FALSE))","v":0},"",null,null,null,null,"3/4",3.5]
["c",null,{"$f":"IF(B13=\"\",,VLOOKUP(B13,'Punkte-Note'!$A$2:$B$178,2,FALSE))","v":0},"",null,null,null,null,"4+",3.75]
["a",null,{"$f":"IF(B14=\"\",,VLOOKUP(B14,'Punkte-Note'!$A$2:$B$178,2,FALSE))","v":0},"",null,null,null,null,"4",4]
["b",null,{"$f":"IF(B15=\"\",,VLOOKUP(B15,'Punkte-Note'!$A$2:$B$178,2,FALSE))","v":0},"",null,null,null,null,"4-",4.25]
["c",null,{"$f":"IF(B16=\"\",,VLOOKUP(B16,'Punkte-Note'!$A$2:$B$178,2,FALSE))","v":0},"",null,null,null,null,"4/5",4.5]
["a",null,{"$f":"IF(B17=\"\",,VLOOKUP(B17,'Punkte-Note'!$A$2:$B$178,2,FALSE))","v":0},"",null,null,null,null,"5+",4.75]
["b",null,{"$f":"IF(B18=\"\",,VLOOKUP(B18,'Punkte-Note'!$A$2:$B$178,2,FALSE))","v":0},"",null,null,null,null,"5",5]
["c",null,{"$f":"IF(B19=\"\",,VLOOKUP(B19,'Punkte-Note'!$A$2:$B$178,2,FALSE))","v":0},"",null,null,null,null,"5-",5.25]
["a",null,{"$f":"IF(B20=\"\",,VLOOKUP(B20,'Punkte-Note'!$A$2:$B$178,2,FALSE))","v":0},"",null,null,null,null,"5/6",5.5]
["b",null,{"$f":"IF(B21=\"\",,VLOOKUP(B21,'Punkte-Note'!$A$2:$B$178,2,FALSE))","v":0},"",null,null,null,null,"6+",5.75]
["c",null,{"$f":"IF(B22=\"\",,VLOOKUP(B22,'Punkte-Note'!$A$2:$B$178,2,FALSE))","v":0},"",null,null,null,null,"6",6]
["a",null,{"$f":"IF(B23=\"\",,VLOOKUP(B23,'Punkte-Note'!$A$2:$B$178,2,FALSE))","v":0},""]
["b",null,{"$f":"IF(B24=\"\",,VLOOKUP(B24,'Punkte-Note'!$A$2:$B$178,2,FALSE))","v":0},""]
["c",null,{"$f":"IF(B25=\"\",,VLOOKUP(B25,'Punkte-Note'!$A$2:$B$178,2,FALSE))","v":0},""]
["a",null,{"$f":"IF(B26=\"\",,VLOOKUP(B26,'Punkte-Note'!$A$2:$B$178,2,FALSE))","v":0},""]
["b",null,{"$f":"IF(B27=\"\",,VLOOKUP(B27,'Punkte-Note'!$A$2:$B$178,2,FALSE))","v":0},""]
["c",null,{"$f":"IF(B28=\"\",,VLOOKUP(B28,'Punkte-Note'!$A$2:$B$178,2,FALSE))","v":0},""]
["a",null,{"$f":"IF(B29=\"\",,VLOOKUP(B29,'Punkte-Note'!$A$2:$B$178,2,FALSE))","v":0},""]
["b",null,{"$f":"IF(B30=\"\",,VLOOKUP(B30,'Punkte-Note'!$A$2:$B$178,2,FALSE))","v":0},""]
["c",null,{"$f":"IF(B31=\"\",,VLOOKUP(B31,'Punkte-Note'!$A$2:$B$178,2,FALSE))","v":0},""]
["a",null,{"$f":"IF(B32=\"\",,VLOOKUP(B32,'Punkte-Note'!$A$2:$B$178,2,FALSE))","v":0},""]
["b",null,{"$f":"IF(B33=\"\",,VLOOKUP(B33,'Punkte-Note'!$A$2:$B$178,2,FALSE))","v":0},""]
["c",null,{"$f":"IF(B34=\"\",,VLOOKUP(B34,'Punkte-Note'!$A$2:$B$178,2,FALSE))","v":0},""]
["a",null,{"$f":"IF(B35=\"\",,VLOOKUP(B35,'Punkte-Note'!$A$2:$B$178,2,FALSE))","v":0},""]
["b",null,{"$f":"IF(B36=\"\",,VLOOKUP(B36,'Punkte-Note'!$A$2:$B$178,2,FALSE))","v":0},""]
["c",null,{"$f":"IF(B37=\"\",,VLOOKUP(B37,'Punkte-Note'!$A$2:$B$178,2,FALSE))","v":0},""]